Reaction Details
TargetNeutrophil elastase
LigandBDBM50034675
Substrate/Competitorn/a
Meas. Tech.ChEMBL_63998 (CHEMBL673107)
Ki 24±n/a nM
Citation Desai, RCCourt, JCFerguson, EGordon, RJHlasta, DJDunlap, RPFranke, CA Phosphonates and phosphinates: novel leaving groups for benzisothiazolone inhibitors of human leukocyte elastase. J Med Chem38:1571-4 (1995) Neutrophil elastase
Name:Neutrophil elastase
Type:Enzyme
Mol. Mass.:28532.38
Organism:Homo sapiens (Human)
Description:P08246
Residue:267
BDBM50034675
NameBDBM50034675
Synonyms:CHEMBL41874 | Dibutyl-phosphinic acid 1,1,3-trioxo-1,3-dihydro-1lambda*6*-benzo[d]isothiazol-2-ylmethyl ester
TypeSmall organic molecule
Emp. Form.C16H24NO5PS
Mol. Mass.373.404
SMILESCCCCP(=O)(CCCC)OCN1C(=O)c2ccccc2S1(=O)=O