Reaction Details
TargetIntegrin alpha-IIb/beta-3
LigandBDBM50034703
Substrate/Competitorn/a
Meas. Tech.ChEMBL_30111 (CHEMBL642038)
IC50 9.0±n/a nM
Citation Hoekstra, WJBeavers, MPAndrade-Gordon, PEvangelisto, MFKeane, PMPress, JBTomko, KAFan, FKloczewiak, MMayo, KH Design and evaluation of nonpeptide fibrinogen gamma-chain based GPIIb/IIIa antagonists. J Med Chem38:1582-92 (1995) Integrin alpha-IIb/beta-3
Name:Integrin alpha-IIb/beta-3
Synonyms:Glycoprotein IIb/IIIa
Type:n/a
Mol. Mass.:n/a
Description:ASSAY_ID of EBI is 30109
Components:This complex has 2 components.
Component 1
Name:Integrin beta-3
Type:Protein
Mol. Mass.:87038.91
Organism:Homo sapiens (Human)
Description:P05106
Residue:788
Component 2
Name:Integrin alpha-IIb
Synonyms:CD_antigen=CD41 GPIIb Glycoprotein IIb ITGA2B Integrin alpha-IIb heavy chain Integrin alpha-IIb light chain, form 2 Integrin alpha-V/beta-3 and alpha-IIb/beta 3 | Platelet membrane glycoprotein IIb
Type:Protein
Mol. Mass.:113354.85
Organism:Homo sapiens (Human)
Description:P08514
Residue:1039
BDBM50034703
NameBDBM50034703
Synonyms:3-{[1-(3-Piperidin-4-yl-propionyl)-piperidine-3-carbonyl]-amino}-propionic acid | CHEMBL289432
TypeSmall organic molecule
Emp. Form.C17H29N3O4
Mol. Mass.339.4299
SMILESOC(=O)CCNC(=O)C1CCCN(C1)C(=O)CCC1CCNCC1