Reaction Details
TargetHistamine H1 receptor
LigandBDBM50034708
Substrate/Competitorn/a
Meas. Tech.ChEMBL_83924 (CHEMBL693689)
Ki>10000±n/a nM
Citation Shih, NYLupo, ATAslanian, ROrlando, SPiwinski, JJGreen, MJGanguly, AKClark, MATozzi, SKreutner, W A novel pyrrolidine analog of histamine as a potent, highly selective histamine H3 receptor agonist. J Med Chem38:1593-9 (1995) Histamine H1 receptor
Name:Histamine H1 receptor
Type:G Protein-Coupled Receptor (GPCR)
Mol. Mass.:55641.53
Organism:Cavia porcellus (domestic guinea pig)
Description:Guinea pig cerebellum was used in binding assay.
Residue:488
BDBM50034708
NameBDBM50034708
Synonyms:4-((2R,3S)-2-Methyl-pyrrolidin-3-yl)-1H-imidazole | CHEMBL18735
TypeSmall organic molecule
Emp. Form.C8H13N3
Mol. Mass.151.2089
SMILESC[C@H]1NCC[C@@H]1c1cnc[nH]1