Reaction Details
TargetHistamine H3 receptor
LigandBDBM50034710
Substrate/Competitorn/a
Meas. Tech.ChEMBL_85848 (CHEMBL693575)
Ki>2000±n/a nM
Citation Shih, NYLupo, ATAslanian, ROrlando, SPiwinski, JJGreen, MJGanguly, AKClark, MATozzi, SKreutner, W A novel pyrrolidine analog of histamine as a potent, highly selective histamine H3 receptor agonist. J Med Chem38:1593-9 (1995) Histamine H3 receptor
Name:Histamine H3 receptor
Type:Enzyme Catalytic Domain
Mol. Mass.:48753.61
Organism:GUINEA PIG
Description:HISTAMINE H3 HRH3 GUINEA PIG::Q9JI35
Residue:445
BDBM50034710
NameBDBM50034710
Synonyms:(1R,2S)-2-(1H-Imidazol-4-yl)-1-methyl-cyclohexylamine | CHEMBL289123
TypeSmall organic molecule
Emp. Form.C10H17N3
Mol. Mass.179.2621
SMILESC[C@@]1(N)CCCC[C@@H]1c1cnc[nH]1