Reaction Details
TargetHistamine H3 receptor
LigandBDBM50034708
Substrate/Competitorn/a
Meas. Tech.ChEMBL_85848 (CHEMBL693575)
Ki 2.8±n/a nM
Citation Shih, NYLupo, ATAslanian, ROrlando, SPiwinski, JJGreen, MJGanguly, AKClark, MATozzi, SKreutner, W A novel pyrrolidine analog of histamine as a potent, highly selective histamine H3 receptor agonist. J Med Chem38:1593-9 (1995) Histamine H3 receptor
Name:Histamine H3 receptor
Type:Enzyme Catalytic Domain
Mol. Mass.:48753.61
Organism:GUINEA PIG
Description:HISTAMINE H3 HRH3 GUINEA PIG::Q9JI35
Residue:445
BDBM50034708
NameBDBM50034708
Synonyms:4-((2R,3S)-2-Methyl-pyrrolidin-3-yl)-1H-imidazole | CHEMBL18735
TypeSmall organic molecule
Emp. Form.C8H13N3
Mol. Mass.151.2089
SMILESC[C@H]1NCC[C@@H]1c1cnc[nH]1