Reaction Details
TargetNeprilysin
LigandBDBM21641
Substrate/Competitorn/a
Meas. Tech.ChEMBL_144615 (CHEMBL750543)
IC50 4.8±n/a nM
Citation Ksander, GMGhai, RDdeJesus, RDiefenbacher, CGYuan, ABerry, CSakane, YTrapani, A Dicarboxylic acid dipeptide neutral endopeptidase inhibitors. J Med Chem38:1689-700 (1995) Neprilysin
Name:Neprilysin
Type:Protein
Mol. Mass.:85789.59
Organism:Rattus norvegicus (Rat)
Description:P07861
Residue:750
BDBM21641
NameBDBM21641
Synonyms:2-(2-benzyl-3-sulfanylpropanamido)acetic acid Thiorphan
TypeSmall organic molecule
Emp. Form.C12H15NO3S
Mol. Mass.253.317
SMILESOC(=O)CNC(=O)C(CS)Cc1ccccc1