Reaction Details
TargetNeprilysin
LigandBDBM50034841
Substrate/Competitorn/a
Meas. Tech.ChEMBL_144615 (CHEMBL750543)
IC50 155±n/a nM
Citation Ksander, GMGhai, RDdeJesus, RDiefenbacher, CGYuan, ABerry, CSakane, YTrapani, A Dicarboxylic acid dipeptide neutral endopeptidase inhibitors. J Med Chem38:1689-700 (1995) Neprilysin
Name:Neprilysin
Type:Protein
Mol. Mass.:85789.59
Organism:Rattus norvegicus (Rat)
Description:P07861
Residue:750
BDBM50034841
NameBDBM50034841
Synonyms:(S)-5-Biphenyl-4-yl-4-(2-carboxy-ethylcarbamoyl)-pentanoic acid | CHEMBL45123
TypeSmall organic molecule
Emp. Form.C21H23NO5
Mol. Mass.369.411
SMILESOC(=O)CCNC(=O)[C@@H](CCC(O)=O)Cc1ccc(cc1)-c1ccccc1