Reaction Details
Target5-hydroxytryptamine receptor 1A
LigandBDBM21393
Substrate/Competitorn/a
Meas. Tech.ChEMBL_1433 (CHEMBL616307)
Ki 1.4±n/a nM
Citation Chilmonczyk, ZLes, AWozniakowska, ACybulski, JKoziol, AEGdaniec, M Buspirone analogues as ligands of the 5-HT1A receptor. 1. The molecular structure of buspirone and its two analogues. J Med Chem38:1701-10 (1995) 5-hydroxytryptamine receptor 1A
Name:5-hydroxytryptamine receptor 1A
Type:G Protein-Coupled Receptor (GPCR)
Mol. Mass.:46445.29
Organism:Rattus norvegicus (rat)
Description:Binding assays were performed using rat hippocampal membranes.
Residue:422
BDBM21393
NameBDBM21393
Synonyms:7-(dipropylamino)-5,6,7,8-tetrahydronaphthalen-1-ol 8-OH-DPAT 8-OH-DPAT,(-) CHEMBL1788118 CHEMBL56 US10562853, Compound 8-OH-DPAT cid_1220
Typeradiolabeled ligand
Emp. Form.C16H25NO
Mol. Mass.247.3758
SMILESCCCN(CCC)C1CCc2cccc(O)c2C1