Reaction Details
TargetMuscarinic acetylcholine receptor M2
LigandBDBM50034870
Substrate/Competitorn/a
Meas. Tech.ChEMBL_138162 (CHEMBL748226)
Ki 9±n/a nM
Citation Kiesewetter, DOSilverton, JVEckelman, WC Syntheses and biological properties of chiral fluoroalkyl quinuclidinyl benzilates. J Med Chem38:1711-9 (1995) Muscarinic acetylcholine receptor M2
Name:Muscarinic acetylcholine receptor M2
Type:Enzyme Catalytic Domain
Mol. Mass.:51555.53
Organism:RAT
Description:P10980
Residue:466
BDBM50034870
NameBDBM50034870
Synonyms:(S)-Hydroxy-(4-iodo-phenyl)-phenyl-acetic acid 1-aza-bicyclo[2.2.2]oct-3-yl ester | CHEMBL297683
TypeSmall organic molecule
Emp. Form.C21H22INO3
Mol. Mass.463.3088
SMILESO[C@@](C(=O)OC1CN2CCC1CC2)(c1ccccc1)c1ccc(I)cc1