Reaction Details
TargetMuscarinic acetylcholine receptor M2
LigandBDBM50034871
Substrate/Competitorn/a
Meas. Tech.ChEMBL_138162 (CHEMBL748226)
Ki 7.6±n/a nM
Citation Kiesewetter, DOSilverton, JVEckelman, WC Syntheses and biological properties of chiral fluoroalkyl quinuclidinyl benzilates. J Med Chem38:1711-9 (1995) Muscarinic acetylcholine receptor M2
Name:Muscarinic acetylcholine receptor M2
Type:Enzyme Catalytic Domain
Mol. Mass.:51555.53
Organism:RAT
Description:P10980
Residue:466
BDBM50034871
NameBDBM50034871
Synonyms:(R)-[4-(2-Fluoro-ethyl)-phenyl]-hydroxy-phenyl-acetic acid 1-aza-bicyclo[2.2.2]oct-3-yl ester | CHEMBL49576
TypeSmall organic molecule
Emp. Form.C23H26FNO3
Mol. Mass.383.4558
SMILESO[C@](C(=O)OC1CN2CCC1CC2)(c1ccccc1)c1ccc(CCF)cc1