Reaction Details
TargetThymidylate synthase
LigandBDBM50035013
Substrate/Competitorn/a
Meas. Tech.ChEMBL_209776 (CHEMBL815566)
Ki 14±n/a nM
Citation Varney, MDPalmer, CLDeal, JGWebber, SWelsh, KMBartlett, CAMorse, CASmith, WWJanson, CA Synthesis and biological evaluation of novel 2,6-diaminobenz[cd]indole inhibitors of thymidylate synthase using the protein structure as a guide. J Med Chem38:1892-903 (1995) Thymidylate synthase
Name:Thymidylate synthase
Type:Enzyme
Mol. Mass.:35718.07
Organism:Homo sapiens (Human)
Description:n/a
Residue:313
BDBM50035013
NameBDBM50035013
Synonyms:5,N*2*,N*6*-Trimethyl-N*6*-pyridin-4-ylmethyl-benzo[cd]indole-2,6-diamine | CHEMBL59203
TypeSmall organic molecule
Emp. Form.C20H20N4
Mol. Mass.316.3996
SMILESCNC1=Nc2ccc(N(C)Cc3ccncc3)c3c(C)ccc1c23