Reaction Details
Target5-hydroxytryptamine receptor 1A
LigandBDBM50007407
Substrate/Competitorn/a
Meas. Tech.ChEMBL_1192 (CHEMBL615958)
Ki 18±n/a nM
Citation Kuipers, Wvan Wijngaarden, IKruse, CGter Horst-van Amstel, MTulp, MTIJzerman, AP N4-unsubstituted N1-arylpiperazines as high-affinity 5-HT1A receptor ligands. J Med Chem38:1942-54 (1995) 5-hydroxytryptamine receptor 1A
Name:5-hydroxytryptamine receptor 1A
Type:G Protein-Coupled Receptor (GPCR)
Mol. Mass.:46445.29
Organism:Rattus norvegicus (rat)
Description:Binding assays were performed using rat hippocampal membranes.
Residue:422
BDBM50007407
NameBDBM50007407
Synonyms:1-NP 4-Naphthalen-1-yl-piperazin-1-ium | CHEMBL277120
TypeSmall organic molecule
Emp. Form.C14H16N2
Mol. Mass.212.2902
SMILESC1CN(CCN1)c1cccc2ccccc12