Reaction Details
TargetMuscarinic acetylcholine receptor M3
LigandBDBM50035280
Substrate/Competitorn/a
Meas. Tech.ChEMBL_138582 (CHEMBL746366)
EC50 140±n/a nM
Citation Bräuner-Osborne, HEbert, BBrann, MRFalch, EKrogsgaard-Larsen, P Annulated heterocyclic bioisosteres of norarecoline. Synthesis and molecular pharmacology at five recombinant human muscarinic acetylcholine receptors. J Med Chem38:2188-95 (1995) Muscarinic acetylcholine receptor M3
Name:Muscarinic acetylcholine receptor M3
Type:Enzyme
Mol. Mass.:66151.03
Organism:Homo sapiens (Human)
Description:P20309
Residue:590
BDBM50035280
NameBDBM50035280
Synonyms:3-Isopropoxy-5,6,7,8-tetrahydro-4H-isoxazolo[4,5-c]azepine | CHEMBL305264
TypeSmall organic molecule
Emp. Form.C10H16N2O2
Mol. Mass.196.2462
SMILESCC(C)Oc1noc2CCCNCc12