Reaction Details
Target5-hydroxytryptamine receptor 1A
LigandBDBM50035316
Substrate/Competitorn/a
Meas. Tech.ChEMBL_1471 (CHEMBL616594)
Ki 8.6±n/a nM
Citation Stjernlöf, PEnnis, MDHansson, LOHoffman, RLGhazal, NBSundell, SSmith, MWSvensson, KCarlsson, AWikström, H Structure-activity relationships in the 8-amino-6,7,8,9-tetrahydro-3H-benz[e]indole ring system. 1. Effects of substituents in the aromatic system on serotonin and dopamine receptor subtypes. J Med Chem38:2202-16 (1995) 5-hydroxytryptamine receptor 1A
Name:5-hydroxytryptamine receptor 1A
Type:G Protein-Coupled Receptor (GPCR)
Mol. Mass.:46445.29
Organism:Rattus norvegicus (rat)
Description:Binding assays were performed using rat hippocampal membranes.
Residue:422
BDBM50035316
NameBDBM50035316
Synonyms:(8-Dipropylamino-6,7,8,9-tetrahydro-3H-benzo[e]indol-1-yl)-phenyl-methanone | CHEMBL302994
TypeSmall organic molecule
Emp. Form.C25H30N2O
Mol. Mass.374.5185
SMILESCCCN(CCC)C1CCc2ccc3[nH]cc(C(=O)c4ccccc4)c3c2C1