Reaction Details
Target5-hydroxytryptamine receptor 1A
LigandBDBM50035329
Substrate/Competitorn/a
Meas. Tech.ChEMBL_1471 (CHEMBL616594)
Ki 3.3±n/a nM
Citation Stjernlöf, PEnnis, MDHansson, LOHoffman, RLGhazal, NBSundell, SSmith, MWSvensson, KCarlsson, AWikström, H Structure-activity relationships in the 8-amino-6,7,8,9-tetrahydro-3H-benz[e]indole ring system. 1. Effects of substituents in the aromatic system on serotonin and dopamine receptor subtypes. J Med Chem38:2202-16 (1995) 5-hydroxytryptamine receptor 1A
Name:5-hydroxytryptamine receptor 1A
Type:G Protein-Coupled Receptor (GPCR)
Mol. Mass.:46445.29
Organism:Rattus norvegicus (rat)
Description:Binding assays were performed using rat hippocampal membranes.
Residue:422
BDBM50035329
NameBDBM50035329
Synonyms:(+/-)-Dipropyl-(6,7,8,9-tetrahydro-3H-benzo[e]indol-8-yl)-amine Dipropyl-(6,7,8,9-tetrahydro-3H-benzo[e]indol-8-yl)-amine
TypeSmall organic molecule
Emp. Form.C18H26N2
Mol. Mass.270.4124
SMILESCCCN(CCC)C1CCc2ccc3[nH]ccc3c2C1