Reaction Details
TargetD(2) dopamine receptor
LigandBDBM50035325
Substrate/Competitorn/a
Meas. Tech.ChEMBL_63066 (CHEMBL673633)
Ki 5.9±n/a nM
Citation Stjernlöf, PEnnis, MDHansson, LOHoffman, RLGhazal, NBSundell, SSmith, MWSvensson, KCarlsson, AWikström, H Structure-activity relationships in the 8-amino-6,7,8,9-tetrahydro-3H-benz[e]indole ring system. 1. Effects of substituents in the aromatic system on serotonin and dopamine receptor subtypes. J Med Chem38:2202-16 (1995) D(2) dopamine receptor
Name:D(2) dopamine receptor
Type:G Protein-Coupled Receptor (GPCR)
Mol. Mass.:50931.60
Organism:Rattus norvegicus (rat)
Description:P61169
Residue:444
BDBM50035325
NameBDBM50035325
Synonyms:(4-Fluoro-1-propyl-6,7,8,9-tetrahydro-3H-benzo[e]indol-8-yl)-dipropyl-amine | CHEMBL71663
TypeSmall organic molecule
Emp. Form.C21H31FN2
Mol. Mass.330.4826
SMILESCCCN(CCC)C1CCc2cc(F)c3[nH]cc(CCC)c3c2C1