Reaction Details
TargetType-1 angiotensin II receptor
LigandBDBM50030731
Substrate/Competitorn/a
Meas. Tech.ChEMBL_36631 (CHEMBL652870)
IC50 0.140000±n/a nM
Citation Chang, LLAshton, WTFlanagan, KLChen, TBO'Malley, SSZingaro, GJSiegl, PKKivlighn, SDLotti, VJChang, RS Triazolinone biphenylsulfonamides as angiotensin II receptor antagonists with high affinity for both the AT1 and AT2 subtypes. J Med Chem37:4464-78 (1995) Type-1 angiotensin II receptor
Name:Type-1 angiotensin II receptor
Type:Enzyme Catalytic Domain
Mol. Mass.:41009.15
Organism:RABBIT
Description:ANGIOTENSIN AT1 AGTR1 RABBIT::P34976
Residue:359
BDBM50030731
NameBDBM50030731
Synonyms:CHEMBL338101 | N-Butyl-3-{3-butyl-4-[2'-(2-chloro-benzoylsulfamoyl)-biphenyl-4-ylmethyl]-5-oxo-4,5-dihydro-[1,2,4]triazol-1-yl}-4-chloro-benzamide
TypeSmall organic molecule
Emp. Form.C37H37Cl2N5O5S
Mol. Mass.734.691
SMILESCCCCNC(=O)c1ccc(Cl)c(c1)-n1nc(CCCC)n(Cc2ccc(cc2)-c2ccccc2S(=O)(=O)NC(=O)c2ccccc2Cl)c1=O