Reaction Details
TargetType-2 angiotensin II receptor
LigandBDBM50035439
Substrate/Competitorn/a
Meas. Tech.ChEMBL_36767 (CHEMBL651097)
IC50 2.3±n/a nM
Citation Chang, LLAshton, WTFlanagan, KLChen, TBO'Malley, SSZingaro, GJSiegl, PKKivlighn, SDLotti, VJChang, RS Triazolinone biphenylsulfonamides as angiotensin II receptor antagonists with high affinity for both the AT1 and AT2 subtypes. J Med Chem37:4464-78 (1995) Type-2 angiotensin II receptor
Name:Type-2 angiotensin II receptor
Type:Enzyme Catalytic Domain
Mol. Mass.:41346.62
Organism:RAT
Description:Angiotensin II AT2 0 0::P35351
Residue:363
BDBM50035439
NameBDBM50035439
Synonyms:CHEMBL343142 | N-(3-{3-Butyl-4-[2'-(2-chloro-benzoylsulfamoyl)-biphenyl-4-ylmethyl]-5-oxo-4,5-dihydro-[1,2,4]triazol-1-yl}-4-chloro-phenyl)-3-methyl-butyramide
TypeSmall organic molecule
Emp. Form.C37H37Cl2N5O5S
Mol. Mass.734.691
SMILESCCCCc1nn(-c2cc(NC(=O)CC(C)C)ccc2Cl)c(=O)n1Cc1ccc(cc1)-c1ccccc1S(=O)(=O)NC(=O)c1ccccc1Cl