Reaction Details
TargetCellular retinoic acid-binding protein 1
LigandBDBM31883
Substrate/Competitorn/a
Meas. Tech.ChEMBL_52395 (CHEMBL661351)
IC50 370±n/a nM
Citation Vaezi, MFAlam, MSani, BPRogers, TSSimpson-Herren, LWille, JJHill, DLDoran, TIBrouillette, WJMuccio, DD A conformationally defined 6-s-trans-retinoic acid isomer: synthesis, chemopreventive activity, and toxicity. J Med Chem37:4499-507 (1995) Cellular retinoic acid-binding protein 1
Name:Cellular retinoic acid-binding protein 1
Type:PROTEIN
Mol. Mass.:15660.02
Organism:Gallus gallus
Description:ChEMBL_52265
Residue:137
BDBM31883
NameBDBM31883
Synonyms:9-cis-retinoic acid (9cRA) AT-RA CHEMBL38 SMR000058245 Vitamin A acid [3H]Retinoic acid [3H]tretinoin cid_444795
Typeradiolabeled ligand
Emp. Form.C20H28O2
Mol. Mass.300.4351
SMILESC\C(\C=C\C1=C(C)CCCC1(C)C)=C/C=C/C(/C)=C/C(O)=O