Reaction Details
TargetCellular retinoic acid-binding protein 1
LigandBDBM50031459
Substrate/Competitorn/a
Meas. Tech.ChEMBL_52395 (CHEMBL661351)
IC50 900±n/a nM
Citation Vaezi, MFAlam, MSani, BPRogers, TSSimpson-Herren, LWille, JJHill, DLDoran, TIBrouillette, WJMuccio, DD A conformationally defined 6-s-trans-retinoic acid isomer: synthesis, chemopreventive activity, and toxicity. J Med Chem37:4499-507 (1995) Cellular retinoic acid-binding protein 1
Name:Cellular retinoic acid-binding protein 1
Type:PROTEIN
Mol. Mass.:15660.02
Organism:Gallus gallus
Description:ChEMBL_52265
Residue:137
BDBM50031459
NameBDBM50031459
Synonyms:(2Z,4E6E,8E)-3,7-dimethyl-9-(2,6,6-trimethylcyclohex-1-en-1-yl)nona-2,4,6,8-tetraenoic acid 13-RA 13-cis-retinoic acid Neovitamin A acid | isotretinoin
TypeSmall organic molecule
Emp. Form.C20H28O2
Mol. Mass.300.4351
SMILESC\C(\C=C\C1=C(C)CCCC1(C)C)=C/C=C/C(/C)=C\C(O)=O