Reaction Details
TargetMuscarinic acetylcholine receptor M2
LigandBDBM50407331
Substrate/Competitorn/a
Meas. Tech.ChEMBL_140196 (CHEMBL744913)
Ki 6.3±n/a nM
Citation Kiesewetter, DOLee, JLang, LPark, SGPaik, CHEckelman, WC Preparation of 18F-labeled muscarinic agonist with M2 selectivity. J Med Chem38:5-8 (1995) Muscarinic acetylcholine receptor M2
Name:Muscarinic acetylcholine receptor M2
Type:Enzyme Catalytic Domain
Mol. Mass.:51555.53
Organism:RAT
Description:P10980
Residue:466
BDBM50407331
NameBDBM50407331
Synonyms:CHEMBL2112940
TypeSmall organic molecule
Emp. Form.C13H20FN3S2
Mol. Mass.301.446
SMILESCN1CCC=C(C1)c1nsnc1SCCCCCF