Reaction Details
TargetMuscarinic receptor M1
LigandBDBM50035989
Substrate/Competitorn/a
Meas. Tech.ChEMBL_140162 (CHEMBL745467)
Ki 23±n/a nM
Citation Kiesewetter, DOLee, JLang, LPark, SGPaik, CHEckelman, WC Preparation of 18F-labeled muscarinic agonist with M2 selectivity. J Med Chem38:5-8 (1995) Muscarinic receptor M1
Name:Muscarinic receptor M1
Synonyms:Muscarinic acetylcholine receptor M1
Type:PROTEIN
Mol. Mass.:15022.43
Organism:Bos taurus
Description:ChEMBL_140161
Residue:139
BDBM50035989
NameBDBM50035989
TypeSmall organic molecule
Emp. Form.C11H17N3S2
Mol. Mass.255.403
SMILESCCCSc1nsnc1C1=CCN(C)CC1