Reaction Details
TargetMuscarinic acetylcholine receptor M2
LigandBDBM50035991
Substrate/Competitorn/a
Meas. Tech.ChEMBL_140196 (CHEMBL744913)
Ki 4±n/a nM
Citation Kiesewetter, DOLee, JLang, LPark, SGPaik, CHEckelman, WC Preparation of 18F-labeled muscarinic agonist with M2 selectivity. J Med Chem38:5-8 (1995) Muscarinic acetylcholine receptor M2
Name:Muscarinic acetylcholine receptor M2
Type:Enzyme Catalytic Domain
Mol. Mass.:51555.53
Organism:RAT
Description:P10980
Residue:466
BDBM50035991
NameBDBM50035991
Synonyms:1-Methyl-4-(4-pentylsulfanyl-[1,2,5]thiadiazol-3-yl)-1,2,3,6-tetrahydro-pyridine | CHEMBL350332
TypeSmall organic molecule
Emp. Form.C13H21N3S2
Mol. Mass.283.456
SMILESCCCCCSc1nsnc1C1=CCN(C)CC1