Reaction Details
TargetNeutrophil elastase
LigandBDBM50036044
Substrate/Competitorn/a
Meas. Tech.ChEMBL_63986 (CHEMBL677612)
Ki 1.2±n/a nM
Citation Edwards, PDWolanin, DJAndisik, DWDavis, MW Peptidyl alpha-ketoheterocyclic inhibitors of human neutrophil elastase. 2. Effect of varying the heterocyclic ring on in vitro potency. J Med Chem38:76-85 (1995) Neutrophil elastase
Name:Neutrophil elastase
Type:Enzyme
Mol. Mass.:28532.38
Organism:Homo sapiens (Human)
Description:P08246
Residue:267
BDBM50036044
NameBDBM50036044
Synonyms:((S)-2-Methyl-1-{(S)-2-[(S)-2-methyl-1-((S)-4-methyl-4,5-dihydro-oxazole-2-carbonyl)-propylcarbamoyl]-pyrrolidine-1-carbonyl}-propyl)-carbamic acid benzyl ester | CHEMBL171288
TypeSmall organic molecule
Emp. Form.C27H38N4O6
Mol. Mass.514.6138
SMILESCC(C)[C@H](NC(=O)OCc1ccccc1)C(=O)N1CCC[C@H]1C(=O)N[C@@H](C(C)C)C(=O)C1=N[C@@H](C)CO1