Reaction Details
TargetNeutrophil elastase
LigandBDBM50036047
Substrate/Competitorn/a
Meas. Tech.ChEMBL_63986 (CHEMBL677612)
Ki 0.6±n/a nM
Citation Edwards, PDWolanin, DJAndisik, DWDavis, MW Peptidyl alpha-ketoheterocyclic inhibitors of human neutrophil elastase. 2. Effect of varying the heterocyclic ring on in vitro potency. J Med Chem38:76-85 (1995) Neutrophil elastase
Name:Neutrophil elastase
Type:Enzyme
Mol. Mass.:28532.38
Organism:Homo sapiens (Human)
Description:P08246
Residue:267
BDBM50036047
NameBDBM50036047
Synonyms:(S)-3-{[(S)-1-((S)-2-Benzyloxycarbonylamino-3-methyl-butyryl)-pyrrolidine-2-carbonyl]-amino}-4-methyl-2-oxo-pentanoic acid methyl ester | CHEMBL166401
TypeSmall organic molecule
Emp. Form.C25H35N3O7
Mol. Mass.489.5613
SMILESCOC(=O)C(=O)[C@@H](NC(=O)[C@@H]1CCCN1C(=O)[C@@H](NC(=O)OCc1ccccc1)C(C)C)C(C)C