Reaction Details
TargetNeutrophil elastase
LigandBDBM50036049
Substrate/Competitorn/a
Meas. Tech.ChEMBL_63986 (CHEMBL677612)
Ki 0.55±n/a nM
Citation Edwards, PDWolanin, DJAndisik, DWDavis, MW Peptidyl alpha-ketoheterocyclic inhibitors of human neutrophil elastase. 2. Effect of varying the heterocyclic ring on in vitro potency. J Med Chem38:76-85 (1995) Neutrophil elastase
Name:Neutrophil elastase
Type:Enzyme
Mol. Mass.:28532.38
Organism:Homo sapiens (Human)
Description:P08246
Residue:267
BDBM50036049
NameBDBM50036049
Synonyms:((S)-1-{(S)-2-[(S)-1-(4,5-Dihydro-oxazole-2-carbonyl)-2-methyl-propylcarbamoyl]-pyrrolidine-1-carbonyl}-2-methyl-propyl)-carbamic acid benzyl ester benzyl (S)-1-((S)-2-(((S)-1-(4,5-dihydrooxazol-2-yl)-3-methyl-1-oxobutan-2-yl)carbamoyl)pyrrolidin-1-yl)-3-methyl-1-oxobutan-2-ylcarbamate
TypeSmall organic molecule
Emp. Form.C26H36N4O6
Mol. Mass.500.5872
SMILESCC(C)[C@H](NC(=O)OCc1ccccc1)C(=O)N1CCC[C@H]1C(=O)N[C@@H](C(C)C)C(=O)C1=NCCO1