Reaction Details
TargetIntegrin alpha-IIb/beta-3
LigandBDBM50036088
Substrate/Competitorn/a
Meas. Tech.ChEMBL_30117 (CHEMBL640474)
Ki 2±n/a nM
Citation Ku, TWMiller, WHBondinell, WEErhard, KFKeenan, RMNichols, AJPeishoff, CESamanen, JMWong, ASHuffman, WF Potent non-peptide fibrinogen receptor antagonists which present an alternative pharmacophore. J Med Chem38:9-12 (1995) Integrin alpha-IIb/beta-3
Name:Integrin alpha-IIb/beta-3
Synonyms:Glycoprotein IIb/IIIa
Type:n/a
Mol. Mass.:n/a
Description:ASSAY_ID of EBI is 30109
Components:This complex has 2 components.
Component 1
Name:Integrin beta-3
Type:Protein
Mol. Mass.:87038.91
Organism:Homo sapiens (Human)
Description:P05106
Residue:788
Component 2
Name:Integrin alpha-IIb
Synonyms:CD_antigen=CD41 GPIIb Glycoprotein IIb ITGA2B Integrin alpha-IIb heavy chain Integrin alpha-IIb light chain, form 2 Integrin alpha-V/beta-3 and alpha-IIb/beta 3 | Platelet membrane glycoprotein IIb
Type:Protein
Mol. Mass.:113354.85
Organism:Homo sapiens (Human)
Description:P08514
Residue:1039
BDBM50036088
NameBDBM50036088
Synonyms:CHEMBL18734 [(7S,13S)-13-(3-Guanidino-propyl)-14-methyl-6,9,12,15-tetraoxo-6,7,8,9,10,11,12,13,14,15-decahydro-5H-20,21-dithia-5,8,11,14-tetraaza-dibenzo[a,e]cycloheptadecen-7-yl]-acetic acid | [13-(3-Guanidino-propyl)-14-methyl-6,9,12,15-tetraoxo-6,7,8,9,10,11,12,13,14,15-decahydro-5H-20,21-dithia-5,8,11,14-tetraaza-dibenzo[a,e]cycloheptadecen-7-yl]-acetic acid (SK&F 107260)
TypeSmall organic molecule
Emp. Form.C26H31N7O6S2
Mol. Mass.601.698
SMILESCN1[C@@H](CCCNC(N)=N)C(=O)NCC(=O)N[C@@H](CC(O)=O)C(=O)Nc2ccccc2SSc2ccccc2C1=O