Reaction Details
TargetNeutrophil elastase
LigandBDBM50036090
Substrate/Competitorn/a
Meas. Tech.ChEMBL_63977 (CHEMBL677603)
Ki 4.9±n/a nM
Citation Veale, CABernstein, PRBryant, CCeccarelli, CDamewood, JREarley, RFeeney, SWGomes, BKosmider, BJSteelman, GB Nonpeptidic inhibitors of human leukocyte elastase. 5. Design, synthesis, and X-ray crystallography of a series of orally active 5-aminopyrimidin-6-one-containing trifluoromethyl ketones. J Med Chem38:98-108 (1995) Neutrophil elastase
Name:Neutrophil elastase
Type:Enzyme
Mol. Mass.:28532.38
Organism:Homo sapiens (Human)
Description:P08246
Residue:267
BDBM50036090
NameBDBM50036090
Synonyms:2-(5-Amino-6-oxo-2-thiophen-2-yl-6H-pyrimidin-1-yl)-N-[2-methyl-1-(4,4,5,5-tetramethyl-[1,3,2]dioxaborolan-2-yl)-propyl]-acetamide | CHEMBL11113
TypeSmall organic molecule
Emp. Form.C20H29BN4O4S
Mol. Mass.432.345
SMILESCC(C)C(NC(=O)Cn1c(ncc(N)c1=O)-c1cccs1)B1OC(C)(C)C(C)(C)O1