Reaction Details
TargetNeutrophil elastase
LigandBDBM50036100
Substrate/Competitorn/a
Meas. Tech.ChEMBL_63977 (CHEMBL677603)
Ki 3.6±n/a nM
Citation Veale, CABernstein, PRBryant, CCeccarelli, CDamewood, JREarley, RFeeney, SWGomes, BKosmider, BJSteelman, GB Nonpeptidic inhibitors of human leukocyte elastase. 5. Design, synthesis, and X-ray crystallography of a series of orally active 5-aminopyrimidin-6-one-containing trifluoromethyl ketones. J Med Chem38:98-108 (1995) Neutrophil elastase
Name:Neutrophil elastase
Type:Enzyme
Mol. Mass.:28532.38
Organism:Homo sapiens (Human)
Description:P08246
Residue:267
BDBM50036100
NameBDBM50036100
Synonyms:CHEMBL11398 | {2-(4-Amino-phenyl)-6-oxo-1-[(3,3,3-trifluoro-1-isopropyl-2-oxo-propylcarbamoyl)-methyl]-1,6-dihydro-pyrimidin-5-yl}-carbamic acid benzyl ester
TypeSmall organic molecule
Emp. Form.C26H26F3N5O5
Mol. Mass.545.5103
SMILESCC(C)C(NC(=O)Cn1c(ncc(NC(=O)OCc2ccccc2)c1=O)-c1ccc(N)cc1)C(=O)C(F)(F)F