Reaction Details
TargetNeutrophil elastase
LigandBDBM50036109
Substrate/Competitorn/a
Meas. Tech.ChEMBL_63977 (CHEMBL677603)
Ki 1.6±n/a nM
Citation Veale, CABernstein, PRBryant, CCeccarelli, CDamewood, JREarley, RFeeney, SWGomes, BKosmider, BJSteelman, GB Nonpeptidic inhibitors of human leukocyte elastase. 5. Design, synthesis, and X-ray crystallography of a series of orally active 5-aminopyrimidin-6-one-containing trifluoromethyl ketones. J Med Chem38:98-108 (1995) Neutrophil elastase
Name:Neutrophil elastase
Type:Enzyme
Mol. Mass.:28532.38
Organism:Homo sapiens (Human)
Description:P08246
Residue:267
BDBM50036109
NameBDBM50036109
Synonyms:2-[5-Cyclohexanesulfonylamino-2-(4-fluoro-phenyl)-6-oxo-6H-pyrimidin-1-yl]-N-(3,3,3-trifluoro-1-isopropyl-2-oxo-propyl)-acetamide | CHEMBL274123
TypeSmall organic molecule
Emp. Form.C24H28F4N4O5S
Mol. Mass.560.562
SMILESCC(C)C(NC(=O)Cn1c(ncc(NS(=O)(=O)C2CCCCC2)c1=O)-c1ccc(F)cc1)C(=O)C(F)(F)F