Reaction Details
TargetNeutrophil elastase
LigandBDBM50036124
Substrate/Competitorn/a
Meas. Tech.ChEMBL_63977 (CHEMBL677603)
Ki 0.96±n/a nM
Citation Veale, CABernstein, PRBryant, CCeccarelli, CDamewood, JREarley, RFeeney, SWGomes, BKosmider, BJSteelman, GB Nonpeptidic inhibitors of human leukocyte elastase. 5. Design, synthesis, and X-ray crystallography of a series of orally active 5-aminopyrimidin-6-one-containing trifluoromethyl ketones. J Med Chem38:98-108 (1995) Neutrophil elastase
Name:Neutrophil elastase
Type:Enzyme
Mol. Mass.:28532.38
Organism:Homo sapiens (Human)
Description:P08246
Residue:267
BDBM50036124
NameBDBM50036124
Synonyms:(2-(4-Fluoro-phenyl)-1-{[2-methyl-1-(4,4,5,5-tetramethyl-[1,3,2]dioxaborolan-2-yl)-propylcarbamoyl]-methyl}-6-oxo-1,6-dihydro-pyrimidin-5-yl)-carbamic acid 3,5-dimethyl-pyridin-4-ylmethyl ester | CHEMBL442524
TypeSmall organic molecule
Emp. Form.C31H39BFN5O6
Mol. Mass.607.481
SMILESCC(C)C(NC(=O)Cn1c(ncc(NC(=O)OCc2c(C)cncc2C)c1=O)-c1ccc(F)cc1)B1OC(C)(C)C(C)(C)O1