Reaction Details
TargetDNA topoisomerase 1
LigandBDBM50036129
Substrate/Competitorn/a
Meas. Tech.ChEMBL_53717 (CHEMBL663645)
IC50 15±n/a nM
Citation Luzzio, MJBesterman, JMEmerson, DLEvans, MGLackey, KLeitner, PLMcIntyre, GMorton, BMyers, PLPeel, M Synthesis and antitumor activity of novel water soluble derivatives of camptothecin as specific inhibitors of topoisomerase I. J Med Chem38:395-401 (1995) DNA topoisomerase 1
Name:DNA topoisomerase 1
Type:Enzyme
Mol. Mass.:90771.02
Organism:Homo sapiens (Human)
Description:P11387
Residue:765
BDBM50036129
NameBDBM50036129
Synonyms:14-chloromethyl-7-ethyl-7-hydroxy-(7S)-7,8,11,13-tetrahydro-10H-[1,3]dioxolo[4,5-g]pyrano[3',4':6,7]indolizino[1,2-b]quinoline-8,11-dione | CHEMBL335455
TypeSmall organic molecule
Emp. Form.C22H17ClN2O6
Mol. Mass.440.833
SMILESCC[C@@]1(O)C(=O)OCc2c1cc1-c3nc4cc5OCOc5cc4c(CCl)c3Cn1c2=O