Reaction Details
TargetDNA topoisomerase 1
LigandBDBM50036132
Substrate/Competitorn/a
Meas. Tech.ChEMBL_53717 (CHEMBL663645)
IC50 11±n/a nM
Citation Luzzio, MJBesterman, JMEmerson, DLEvans, MGLackey, KLeitner, PLMcIntyre, GMorton, BMyers, PLPeel, M Synthesis and antitumor activity of novel water soluble derivatives of camptothecin as specific inhibitors of topoisomerase I. J Med Chem38:395-401 (1995) DNA topoisomerase 1
Name:DNA topoisomerase 1
Type:Enzyme
Mol. Mass.:90771.02
Organism:Homo sapiens (Human)
Description:P11387
Residue:765
BDBM50036132
NameBDBM50036132
Synonyms:15-chloromethyl-8-ethyl-8-hydroxy-(8S)-2,3,8,9,12,14-hexahydro-11H-[1,4]dioxino[2,3-g]pyrano[3',4':6,7]indolizino[1,2-b]quinoline-9,12-dione | CHEMBL338843
TypeSmall organic molecule
Emp. Form.C23H19ClN2O6
Mol. Mass.454.86
SMILESCC[C@@]1(O)C(=O)OCc2c1cc1-c3nc4cc5OCCOc5cc4c(CCl)c3Cn1c2=O