Reaction Details
TargetATP-citrate synthase
LigandBDBM50036210
Substrate/Competitorn/a
Meas. Tech.ChEMBL_29524 (CHEMBL640440)
Ki 150±n/a nM
Citation Dolle, REGribble, AWilkes, TKruse, LIEggleston, DSaxty, BAWells, TNGroot, PH Synthesis of novel thiol-containing citric acid analogues. Kinetic evaluation of these and other potential active-site-directed and mechanism-based inhibitors of ATP citrate lyase. J Med Chem38:537-43 (1995) ATP-citrate synthase
Name:ATP-citrate synthase
Type:PROTEIN
Mol. Mass.:120645.65
Organism:Rattus norvegicus
Description:ChEMBL_857791
Residue:1100
BDBM50036210
NameBDBM50036210
Synonyms:(2S,3S)-3-Carboxy-2,3-dihydroxy-pentanedioic acid | CHEMBL118715
TypeSmall organic molecule
Emp. Form.C6H8O8
Mol. Mass.208.1229
SMILESO[C@H](C(O)=O)[C@@](O)(CC(O)=O)C(O)=O