Reaction Details
TargetSigma non-opioid intracellular receptor 1
LigandBDBM50036241
Substrate/Competitorn/a
Meas. Tech.ChEMBL_202041 (CHEMBL809514)
Ki 2.08±n/a nM
Citation Mascarella, SWBai, XWilliams, WSine, BBowen, WDCarroll, FI (+)-cis-N-(para-, meta-, and ortho-substituted benzyl)-N-normetazocines: synthesis and binding affinity at the [3H]-(+)-pentazocine-labeled (sigma 1) site and quantitative structure-affinity relationship studies. J Med Chem38:565-9 (1995) Sigma non-opioid intracellular receptor 1
Name:Sigma non-opioid intracellular receptor 1
Type:Enzyme Catalytic Domain
Mol. Mass.:25124.85
Organism:Homo sapiens (Human)
Description:Q99720
Residue:223
BDBM50036241
NameBDBM50036241
Synonyms:(2S,6S,11S)-6,11-Dimethyl-3-(4-methyl-benzyl)-1,2,3,4,5,6-hexahydro-2,6-methano-benzo[d]azocin-8-ol | CHEMBL157390
TypeSmall organic molecule
Emp. Form.C22H27NO
Mol. Mass.321.4559
SMILESC[C@@H]1[C@@H]2Cc3ccc(O)cc3[C@@]1(C)CCN2Cc1ccc(C)cc1