Reaction Details
TargetGag-Pol polyprotein [489-587]
LigandBDBM50036257
Substrate/Competitorn/a
Meas. Tech.ChEMBL_157540 (CHEMBL764925)
Ki 0.5±n/a nM
Citation Vazquez, MLBryant, MLClare, MDeCrescenzo, GADoherty, EMFreskos, JNGetman, DPHouseman, KAJulien, JAKocan, GP Inhibitors of HIV-1 protease containing the novel and potent (R)-(hydroxyethyl)sulfonamide isostere. J Med Chem38:581-4 (1995) Gag-Pol polyprotein [489-587]
Name:Gag-Pol polyprotein [489-587]
Type:Enzyme Subunit
Mol. Mass.:10781.16
Organism:Human immunodeficiency virus type 1
Description:P04585[489-587]
Residue:99
BDBM50036257
NameBDBM50036257
Synonyms:((S)-1-{(1S,2R)-3-[Benzenesulfonyl-(3-methyl-butyl)-amino]-1-benzyl-2-hydroxy-propylcarbamoyl}-2-carbamoyl-ethyl)-carbamic acid pyridin-2-ylmethyl ester | CHEMBL351994
TypeSmall organic molecule
Emp. Form.C32H41N5O7S
Mol. Mass.639.762
SMILESCC(C)CCN(C[C@@H](O)[C@H](Cc1ccccc1)NC(=O)[C@H](CC(N)=O)NC(=O)OCc1ccccn1)S(=O)(=O)c1ccccc1