Reaction Details
TargetD(1A) dopamine receptor
LigandBDBM50016013
Substrate/Competitorn/a
Meas. Tech.ChEMBL_58506 (CHEMBL672001)
Ki 20.4±n/a nM
Citation Hedberg, MHJohansson, AMNordvall, GYliniemelä, ALi, HBMartin, ARHjorth, SUnelius, LSundell, SHacksell, U (R)-11-hydroxy- and (R)-11-hydroxy-10-methylaporphine: synthesis, pharmacology, and modeling of D2A and 5-HT1A receptor interactions. J Med Chem38:647-58 (1995) D(1A) dopamine receptor
Name:D(1A) dopamine receptor
Type:Enzyme Catalytic Domain
Mol. Mass.:49429.75
Organism:RAT
Description:P18901
Residue:446
BDBM50016013
NameBDBM50016013
Synonyms:(R)-6-methyl-5,6,6a,7-tetrahydro-4H-dibenzo[de,g]quinolin-11-ol CHEMBL119455 | R-(-)-11-hydroxy-aporphine
TypeSmall organic molecule
Emp. Form.C17H17NO
Mol. Mass.251.323
SMILESCN1CCc2cccc-3c2[C@H]1Cc1cccc(O)c-31