Reaction Details
TargetThromboxane-A synthase
LigandBDBM50010960
Substrate/Competitorn/a
Meas. Tech.ChEMBL_210278 (CHEMBL808525)
IC50 17±n/a nM
Citation Faull, AWBrewster, AGBrown, GRSmithers, MJJackson, R Dual-acting thromboxane receptor antagonist/synthase inhibitors: synthesis and biological properties of [2-substituted-4-(3-pyridyl)-1,3-dioxan-5-yl] alkenoic acids. J Med Chem38:686-94 (1995) Thromboxane-A synthase
Name:Thromboxane-A synthase
Type:Enzyme
Mol. Mass.:60524.67
Organism:Homo sapiens (Human)
Description:P24557
Residue:533
BDBM50010960
NameBDBM50010960
Synonyms:(E)-7-Phenyl-7-pyridin-3-yl-hept-6-enoic acid 7-Phenyl-7-pyridin-3-yl-hept-6-enoic acid(CV-4151) CV-4151
TypeSmall organic molecule
Emp. Form.C18H19NO2
Mol. Mass.281.349
SMILESOC(=O)CCCC\C=C(/c1ccccc1)c1cccnc1