Reaction Details
TargetNeutrophil elastase
LigandBDBM50036475
Substrate/Competitorn/a
Meas. Tech.ChEMBL_64003 (CHEMBL673112)
Ki 0.014±n/a nM
Citation Hlasta, DJSubramanyam, CBell, MRCarabateas, PMCourt, JJDesai, RCDrozd, MLEickhoff, WMFerguson, EWGordon, RJ Orally bioavailable benzisothiazolone inhibitors of human leukocyte elastase. J Med Chem38:739-44 (1995) Neutrophil elastase
Name:Neutrophil elastase
Type:Enzyme
Mol. Mass.:28532.38
Organism:Homo sapiens (Human)
Description:P08246
Residue:267
BDBM50036475
NameBDBM50036475
Synonyms:2,6-Dichloro-3-(2-pyrrolidin-1-yl-ethoxy)-benzoic acid 4-isopropyl-6-methoxy-1,1,3-trioxo-1,3-dihydro-1lambda*6*-benzo[d]isothiazol-2-ylmethyl ester | CHEMBL435666
TypeSmall organic molecule
Emp. Form.C25H28Cl2N2O7S
Mol. Mass.571.47
SMILESCOc1cc2c(C(=O)N(COC(=O)c3c(Cl)ccc(OCCN4CCCC4)c3Cl)S2(=O)=O)c(c1)C(C)C