Reaction Details
TargetNeutrophil elastase
LigandBDBM50036480
Substrate/Competitorn/a
Meas. Tech.ChEMBL_64003 (CHEMBL673112)
Ki 0.008±n/a nM
Citation Hlasta, DJSubramanyam, CBell, MRCarabateas, PMCourt, JJDesai, RCDrozd, MLEickhoff, WMFerguson, EWGordon, RJ Orally bioavailable benzisothiazolone inhibitors of human leukocyte elastase. J Med Chem38:739-44 (1995) Neutrophil elastase
Name:Neutrophil elastase
Type:Enzyme
Mol. Mass.:28532.38
Organism:Homo sapiens (Human)
Description:P08246
Residue:267
BDBM50036480
NameBDBM50036480
Synonyms:2,6-Dichloro-3-(2-morpholin-4-yl-ethoxy)-benzoic acid 4-isopropyl-1,1,3-trioxo-1,3-dihydro-1lambda*6*-benzo[d]isothiazol-2-ylmethyl ester WIN-63294
TypeSmall organic molecule
Emp. Form.C24H26Cl2N2O7S
Mol. Mass.557.443
SMILESCC(C)c1cccc2c1C(=O)N(COC(=O)c1c(Cl)ccc(OCCN3CCOCC3)c1Cl)S2(=O)=O