Reaction Details
TargetSerotonin 2 (5-HT2) receptor
LigandBDBM50036650
Substrate/Competitorn/a
Meas. Tech.ChEMBL_2390 (CHEMBL617668)
Ki 109±n/a nM
Citation Mewshaw, REAbreu, MESilverman, LSMathew, RMTiffany, CWBailey, MAKarbon, EWFerkany, JWKaiser, C Examination of the D2/5-HT2 affinity ratios of resolved 5,6,7,8,9,10-hexahydro-7,10-iminocyclohept[b]indoles: an enantioselective approach toward the design of potential atypical antipsychotics. J Med Chem36:3073-6 (1993) Serotonin 2 (5-HT2) receptor
Name:Serotonin 2 (5-HT2) receptor
Synonyms:5-hydroxytryptamine receptor 2A/2B/2C
Type:n/a
Mol. Mass.:n/a
Description:ASSAY_ID of ChEMBL is 2197419
Components:This complex has 3 components.
Component 1
Name:5-hydroxytryptamine receptor 2B
Type:Enzyme Catalytic Domain
Mol. Mass.:53668.47
Organism:RAT
Description:5-HT2B HTR2B RAT::P30994
Residue:479
Component 2
Name:5-hydroxytryptamine receptor 2C
Synonyms:5-HT2C 5-hydroxytryptamine receptor 2C (5HT2c) 5ht1c Htr2c Serotonin receptor 2a and 2c (5HT2A and 5HT2C)
Type:Enzyme
Mol. Mass.:51935.10
Organism:Rattus norvegicus (Rat)
Description:P08909
Residue:460
Component 3
Name:5-hydroxytryptamine receptor 2A
Synonyms:5-HT-2A 5-HT2A 5-hydroxytryptamine receptor 2A (5HT2A) Htr2 Serotonin Receptor 2A
Type:G Protein-Coupled Receptor (GPCR)
Mol. Mass.:52852.05
Organism:Rattus norvegicus (rat)
Description:Rat cortex membranes 5-HT2A receptors.
Residue:471
BDBM50036650
NameBDBM50036650
Synonyms:(7R,10S)-5-[5-fluoro-9,15-diazatetracyclo[10.2.1.02,10.03,8]pentadeca-2(10),3,5,7-tetraen-15-yl]-1-(4-fluorophenyl)-1-pentanone 5-[5-fluoro-9,15-diazatetracyclo[10.2.1.02,10.03,8]pentadeca-2(10),3,5,7-tetraen-15-yl]-1-(4-fluorophenyl)-1-pentanone | CHEMBL291254
TypeSmall organic molecule
Emp. Form.C24H24F2N2O
Mol. Mass.394.457
SMILESFc1ccc(cc1)C(=O)CCCCN1C2CCC1c1c(C2)[nH]c2ccc(F)cc12