Reaction Details
TargetD(3) dopamine receptor
LigandBDBM50036734
Substrate/Competitorn/a
Meas. Tech.ChEBML_42562
Ki 330±n/a nM
Citation Jaen, JCCaprathe, BWPugsley, TAWise, LDAkunne, H Evaluation of the effects of the enantiomers of reduced haloperidol, azaperol, and related 4-amino-1-arylbutanols on dopamine and sigma receptors. J Med Chem36:3929-36 (1994) D(3) dopamine receptor
Name:D(3) dopamine receptor
Type:n/a
Mol. Mass.:44243.43
Organism:Homo sapiens (Human)
Description:n/a
Residue:400
BDBM50036734
NameBDBM50036734
Synonyms:(S)-4-(4-Chloro-phenyl)-1-[4-(4-fluoro-phenyl)-4-hydroxy-butyl]-piperidin-4-ol | CHEMBL129237
TypeSmall organic molecule
Emp. Form.C21H25ClFNO2
Mol. Mass.377.88
SMILESO[C@@H](CCCN1CCC(O)(CC1)c1ccc(Cl)cc1)c1ccc(F)cc1