Reaction Details
TargetD(3) dopamine receptor
LigandBDBM50036737
Substrate/Competitorn/a
Meas. Tech.ChEBML_42562
Ki>2000±n/a nM
Citation Jaen, JCCaprathe, BWPugsley, TAWise, LDAkunne, H Evaluation of the effects of the enantiomers of reduced haloperidol, azaperol, and related 4-amino-1-arylbutanols on dopamine and sigma receptors. J Med Chem36:3929-36 (1994) D(3) dopamine receptor
Name:D(3) dopamine receptor
Type:n/a
Mol. Mass.:44243.43
Organism:Homo sapiens (Human)
Description:n/a
Residue:400
BDBM50036737
NameBDBM50036737
Synonyms:(R)-1-(4-Fluoro-phenyl)-4-[4-(5-fluoro-pyrimidin-2-yl)-piperazin-1-yl]-butan-1-ol | CHEMBL129768
TypeSmall organic molecule
Emp. Form.C18H22F2N4O
Mol. Mass.348.3903
SMILESO[C@H](CCCN1CCN(CC1)c1ncc(F)cn1)c1ccc(F)cc1