Reaction Details
TargetMu-type opioid receptor
LigandBDBM50036787
Substrate/Competitorn/a
Meas. Tech.ChEMBL_138885 (CHEMBL747877)
IC50 0.13±n/a nM
Citation Pitzele, BSHamilton, RWKudla, KDTsymbalov, SStapelfeld, ASavage, MAClare, MHammond, DLHansen, DW Enkephalin analogs as systemically active antinociceptive agents: O- and N-alkylated derivatives of the dipeptide amide L-2,6-dimethyltyrosyl-N-(3-phenylpropyl)-D-alaninamide. J Med Chem37:888-96 (1994) Mu-type opioid receptor
Name:Mu-type opioid receptor
Type:G Protein-Coupled Receptor (GPCR)
Mol. Mass.:44503.11
Organism:Rattus norvegicus (rat)
Description:Competition binding assays were carried out using membrane preparations from transfected HN9.10 cells that constitutively expressed the mu opioid receptor.
Residue:398
BDBM50036787
NameBDBM50036787
Synonyms:2-Amino-3-(4-hydroxy-2,6-dimethyl-phenyl)-N-[(R)-1-(3-phenyl-propylcarbamoyl)-ethyl]-propionamide | CHEMBL171763
TypeSmall organic molecule
Emp. Form.C23H31N3O3
Mol. Mass.397.5105
SMILESC[C@@H](NC(=O)C(N)Cc1c(C)cc(O)cc1C)C(=O)NCCCc1ccccc1