Reaction Details
TargetAminopeptidase N
LigandBDBM50036969
Substrate/Competitorn/a
Meas. Tech.ChEMBL_35493 (CHEMBL646403)
Ki 32±n/a nM
Citation Chauvel, ENLlorens-Cortès, CCoric, PWilk, SRoques, BPFournié-Zaluski, MC Differential inhibition of aminopeptidase A and aminopeptidase N by new beta-amino thiols. J Med Chem37:2950-7 (1994) Aminopeptidase N
Name:Aminopeptidase N
Type:Protein
Mol. Mass.:108810.25
Organism:Sus scrofa (Pig)
Description:P15145
Residue:963
BDBM50036969
NameBDBM50036969
Synonyms:(S)-2-Amino-pentane-1,5-dithiol | CHEMBL101771
TypeSmall organic molecule
Emp. Form.C5H13NS2
Mol. Mass.151.293
SMILESN[C@H](CS)CCCS