Reaction Details
TargetAminopeptidase N
LigandBDBM50036963
Substrate/Competitorn/a
Meas. Tech.ChEMBL_35493 (CHEMBL646403)
Ki 15500±n/a nM
Citation Chauvel, ENLlorens-Cortès, CCoric, PWilk, SRoques, BPFournié-Zaluski, MC Differential inhibition of aminopeptidase A and aminopeptidase N by new beta-amino thiols. J Med Chem37:2950-7 (1994) Aminopeptidase N
Name:Aminopeptidase N
Type:Protein
Mol. Mass.:108810.25
Organism:Sus scrofa (Pig)
Description:P15145
Residue:963
BDBM50036963
NameBDBM50036963
Synonyms:(R)-4-Carboxy-1-mercaptomethyl-butyl-ammonium CHEMBL102006
TypeSmall organic molecule
Emp. Form.C6H13NO2S
Mol. Mass.163.238
SMILESN[C@@H](CS)CCCC(O)=O