Reaction Details
TargetGlutamyl aminopeptidase
LigandBDBM50036964
Substrate/Competitorn/a
Meas. Tech.ChEMBL_32829 (CHEMBL646207)
Ki 280±n/a nM
Citation Chauvel, ENLlorens-Cortès, CCoric, PWilk, SRoques, BPFournié-Zaluski, MC Differential inhibition of aminopeptidase A and aminopeptidase N by new beta-amino thiols. J Med Chem37:2950-7 (1994) Glutamyl aminopeptidase
Name:Glutamyl aminopeptidase
Type:PROTEIN
Mol. Mass.:109226.47
Organism:Homo sapiens (Human)
Description:ChEMBL_32829
Residue:957
BDBM50036964
NameBDBM50036964
Synonyms:2-(3-Amino-4-mercapto-butyl)-malonic acid | CHEMBL102084
TypeSmall organic molecule
Emp. Form.C7H13NO4S
Mol. Mass.207.247
SMILESNC(CS)CCC(C(O)=O)C(O)=O