Reaction Details
TargetGlutamyl aminopeptidase
LigandBDBM50036962
Substrate/Competitorn/a
Meas. Tech.ChEMBL_32829 (CHEMBL646207)
Ki 130±n/a nM
Citation Chauvel, ENLlorens-Cortès, CCoric, PWilk, SRoques, BPFournié-Zaluski, MC Differential inhibition of aminopeptidase A and aminopeptidase N by new beta-amino thiols. J Med Chem37:2950-7 (1994) Glutamyl aminopeptidase
Name:Glutamyl aminopeptidase
Type:PROTEIN
Mol. Mass.:109226.47
Organism:Homo sapiens (Human)
Description:ChEMBL_32829
Residue:957
BDBM50036962
NameBDBM50036962
Synonyms:(S)-4-Carboxy-1-mercaptomethyl-butyl-ammonium CHEMBL101147
TypeSmall organic molecule
Emp. Form.C6H13NO2S
Mol. Mass.163.238
SMILESN[C@H](CS)CCCC(O)=O