Reaction Details
TargetRenin
LigandBDBM50036977
Substrate/Competitorn/a
Meas. Tech.ChEMBL_195974 (CHEMBL807522)
pH7.4±n/a
IC50 1.5±n/a nM
Commentsextracted
Citation Boyd, SAFung, AKBaker, WRMantei, RAStein, HHCohen, JBarlow, JLKlinghofer, VWessale, JLVerburg, KM Nonpeptide renin inhibitors with good intraduodenal bioavailability and efficacy in dog. J Med Chem37:2991-3007 (1994) Renin
Name:Renin
Type:Enzyme
Mol. Mass.:45058.99
Organism:Homo sapiens (Human)
Description:n/a
Residue:406
BDBM50036977
NameBDBM50036977
Synonyms:1N-[3-amino(cyanoimino)methylaminopropyl]-5-[1-[1-benzyl-2-(4-methoxymethoxyhexahydro-1-pyridinyl)-2-oxo-(1S)-ethyloxy]-(1S)-pentylcarboxamido]-4-hydroxy-2-isopropyl-6-phenyl-(2S,4S,5S)-hexanamide | CHEMBL317329
TypeSmall organic molecule
Emp. Form.C42H69N7O7
Mol. Mass.784.04
SMILESCCCC[C@H](O[C@@H](Cc1ccccc1)C(=O)N1CCC(CC1)OCOC)C(=O)N[C@@H](CC1CCCCC1)[C@@H](O)C[C@@H](C(C)C)C(=O)NCCCNC(N)=NC#N