Reaction Details
TargetRenin
LigandBDBM50036987
Substrate/Competitorn/a
Meas. Tech.ChEMBL_195973 (CHEMBL879243)
IC50 12±n/a nM
Citation Boyd, SAFung, AKBaker, WRMantei, RAStein, HHCohen, JBarlow, JLKlinghofer, VWessale, JLVerburg, KM Nonpeptide renin inhibitors with good intraduodenal bioavailability and efficacy in dog. J Med Chem37:2991-3007 (1994) Renin
Name:Renin
Type:Enzyme
Mol. Mass.:45058.99
Organism:Homo sapiens (Human)
Description:n/a
Residue:406
BDBM50036987
NameBDBM50036987
Synonyms:(2S,4S,5S)-5-{(S)-2-[(S)-1-Benzyl-2-(4-methoxymethoxy-piperidin-1-yl)-2-oxo-ethylamino]-hexanoylamino}-6-cyclohexyl-4-hydroxy-2-isopropyl-hexanoic acid (2-amino-2-methyl-propyl)-amide | CHEMBL319832
TypeSmall organic molecule
Emp. Form.C41H71N5O6
Mol. Mass.730.0323
SMILESCCCC[C@H](N[C@@H](Cc1ccccc1)C(=O)N1CCC(CC1)OCOC)C(=O)N[C@@H](CC1CCCCC1)[C@@H](O)C[C@@H](C(C)C)C(=O)NCC(C)(C)N